Reaction Details
TargetDelta-type opioid receptor
LigandBDBM50092677
Substrate/Competitorn/a
Meas. Tech.ChEMBL_145322 (CHEMBL750410)
IC50 406±n/a nM
Citation Plobeck, NDelorme, DWei, ZYYang, HZhou, FSchwarz, PGawell, LGagnon, HPelcman, BSchmidt, RYue, SYWalpole, CBrown, WZhou, ELabarre, MPayza, KSt-Onge, SKamassah, AMorin, PEProjean, DDucharme, JRoberts, E New diarylmethylpiperazines as potent and selective nonpeptidic delta opioid receptor agonists with increased In vitro metabolic stability. J Med Chem43:3878-94 (2000) Delta-type opioid receptor
Name:Delta-type opioid receptor
Type:G Protein-Coupled Receptor (GPCR)
Mol. Mass.:40382.98
Organism:Homo sapiens (Human)
Description:Competition binding assays were carried out using membrane preparations from transfected HN9.10 cells that constitutively expressed the delta opioid receptor.
Residue:372
BDBM50092677
NameBDBM50092677
Synonyms:2-[4-(Phenyl-piperazin-1-yl-methyl)-phenyl]-propan-2-ol | CHEMBL129391
TypeSmall organic molecule
Emp. Form.C20H26N2O
Mol. Mass.310.4332
SMILESCC(C)(O)c1ccc(cc1)C(N1CCNCC1)c1ccccc1