Reaction Details
TargetDelta-type opioid receptor
LigandBDBM50092694
Substrate/Competitorn/a
Meas. Tech.ChEMBL_145322 (CHEMBL750410)
IC50 100±n/a nM
Citation Plobeck, NDelorme, DWei, ZYYang, HZhou, FSchwarz, PGawell, LGagnon, HPelcman, BSchmidt, RYue, SYWalpole, CBrown, WZhou, ELabarre, MPayza, KSt-Onge, SKamassah, AMorin, PEProjean, DDucharme, JRoberts, E New diarylmethylpiperazines as potent and selective nonpeptidic delta opioid receptor agonists with increased In vitro metabolic stability. J Med Chem43:3878-94 (2000) Delta-type opioid receptor
Name:Delta-type opioid receptor
Type:G Protein-Coupled Receptor (GPCR)
Mol. Mass.:40382.98
Organism:Homo sapiens (Human)
Description:Competition binding assays were carried out using membrane preparations from transfected HN9.10 cells that constitutively expressed the delta opioid receptor.
Residue:372
BDBM50092694
NameBDBM50092694
Synonyms:2-Ethyl-1-[4-(phenyl-piperazin-1-yl-methyl)-phenyl]-butan-1-one | CHEMBL126918
TypeSmall organic molecule
Emp. Form.C23H30N2O
Mol. Mass.350.4971
SMILESCCC(CC)C(=O)c1ccc(cc1)C(N1CCNCC1)c1ccccc1