Reaction Details
TargetMu-type opioid receptor
LigandBDBM50092681
Substrate/Competitorn/a
Meas. Tech.ChEMBL_145601 (CHEMBL749744)
IC50 620±n/a nM
Citation Plobeck, NDelorme, DWei, ZYYang, HZhou, FSchwarz, PGawell, LGagnon, HPelcman, BSchmidt, RYue, SYWalpole, CBrown, WZhou, ELabarre, MPayza, KSt-Onge, SKamassah, AMorin, PEProjean, DDucharme, JRoberts, E New diarylmethylpiperazines as potent and selective nonpeptidic delta opioid receptor agonists with increased In vitro metabolic stability. J Med Chem43:3878-94 (2000) Mu-type opioid receptor
Name:Mu-type opioid receptor
Type:G Protein-Coupled Receptor (GPCR)
Mol. Mass.:44789.51
Organism:Homo sapiens (Human)
Description:P35372
Residue:400
BDBM50092681
NameBDBM50092681
Synonyms:CHEMBL127434 | N,N-Diethyl-4-[(3-methoxy-phenyl)-(2,5,5-trimethyl-piperazin-1-yl)-methyl]-benzamide
TypeSmall organic molecule
Emp. Form.C26H37N3O2
Mol. Mass.423.5909
SMILESCCN(CC)C(=O)c1ccc(cc1)C(N1CC(C)(C)NCC1C)c1cccc(OC)c1