Reaction Details
TargetKappa-type opioid receptor
LigandBDBM50092686
Substrate/Competitorn/a
Meas. Tech.ChEMBL_145104 (CHEMBL751988)
IC50>5600±n/a nM
Citation Plobeck, NDelorme, DWei, ZYYang, HZhou, FSchwarz, PGawell, LGagnon, HPelcman, BSchmidt, RYue, SYWalpole, CBrown, WZhou, ELabarre, MPayza, KSt-Onge, SKamassah, AMorin, PEProjean, DDucharme, JRoberts, E New diarylmethylpiperazines as potent and selective nonpeptidic delta opioid receptor agonists with increased In vitro metabolic stability. J Med Chem43:3878-94 (2000) Kappa-type opioid receptor
Name:Kappa-type opioid receptor
Type:G Protein-Coupled Receptor (GPCR)
Mol. Mass.:42648.76
Organism:Homo sapiens (Human)
Description:P41145
Residue:380
BDBM50092686
NameBDBM50092686
Synonyms:4-[(4-Cyclopropylmethyl-piperazin-1-yl)-phenyl-methyl]-N,N-diethyl-benzamide | CHEMBL125248
TypeSmall organic molecule
Emp. Form.C26H35N3O
Mol. Mass.405.5756
SMILESCCN(CC)C(=O)c1ccc(cc1)C(N1CCN(CC2CC2)CC1)c1ccccc1