Reaction Details
TargetMu-type opioid receptor
LigandBDBM50077066
Substrate/Competitorn/a
Meas. Tech.ChEMBL_145601 (CHEMBL749744)
IC50 5064.0±n/a nM
Citation Plobeck, NDelorme, DWei, ZYYang, HZhou, FSchwarz, PGawell, LGagnon, HPelcman, BSchmidt, RYue, SYWalpole, CBrown, WZhou, ELabarre, MPayza, KSt-Onge, SKamassah, AMorin, PEProjean, DDucharme, JRoberts, E New diarylmethylpiperazines as potent and selective nonpeptidic delta opioid receptor agonists with increased In vitro metabolic stability. J Med Chem43:3878-94 (2000) Mu-type opioid receptor
Name:Mu-type opioid receptor
Type:G Protein-Coupled Receptor (GPCR)
Mol. Mass.:44789.51
Organism:Homo sapiens (Human)
Description:P35372
Residue:400
BDBM50077066
NameBDBM50077066
Synonyms:4-[(4-Allyl-piperazin-1-yl)-phenyl-methyl]-N,N-diethyl-benzamide CHEMBL544641
TypeSmall organic molecule
Emp. Form.C25H33N3O
Mol. Mass.391.549
SMILESCCN(CC)C(=O)c1ccc(cc1)C(N1CCN(CC=C)CC1)c1ccccc1