Reaction Details
TargetDelta-type opioid receptor
LigandBDBM50092714
Substrate/Competitorn/a
Meas. Tech.ChEMBL_145330 (CHEMBL750418)
IC50 2.1±n/a nM
Citation Wei, ZYBrown, WTakasaki, BPlobeck, NDelorme, DZhou, FYang, HJones, PGawell, LGagnon, HSchmidt, RYue, SYWalpole, CPayza, KSt-Onge, SLabarre, MGodbout, CJakob, AButterworth, JKamassah, AMorin, PEProjean, DDucharme, JRoberts, E N,N-Diethyl-4-(phenylpiperidin-4-ylidenemethyl)benzamide: a novel, exceptionally selective, potent delta opioid receptor agonist with oral bioavailability and its analogues. J Med Chem43:3895-905 (2000) Delta-type opioid receptor
Name:Delta-type opioid receptor
Type:G Protein-Coupled Receptor (GPCR)
Mol. Mass.:40382.98
Organism:Homo sapiens (Human)
Description:Competition binding assays were carried out using membrane preparations from transfected HN9.10 cells that constitutively expressed the delta opioid receptor.
Residue:372
BDBM50092714
NameBDBM50092714
Synonyms:CHEMBL126141 | N,N-Diethyl-4-{[1-(3-methyl-but-2-enyl)-piperidin-4-ylidene]-phenyl-methyl}-benzamide
TypeSmall organic molecule
Emp. Form.C28H36N2O
Mol. Mass.416.5982
SMILES[#6]-[#6]-[#7](-[#6]-[#6])-[#6](=O)-c1ccc(cc1)-[#6](=[#6]-1\[#6]-[#6]-[#7](-[#6]\[#6]=[#6](\[#6])-[#6])-[#6]-[#6]-1)\c1ccccc1