Reaction Details
TargetDelta-type opioid receptor
LigandBDBM50092720
Substrate/Competitorn/a
Meas. Tech.ChEMBL_145330 (CHEMBL750418)
IC50 2.9±n/a nM
Citation Wei, ZYBrown, WTakasaki, BPlobeck, NDelorme, DZhou, FYang, HJones, PGawell, LGagnon, HSchmidt, RYue, SYWalpole, CPayza, KSt-Onge, SLabarre, MGodbout, CJakob, AButterworth, JKamassah, AMorin, PEProjean, DDucharme, JRoberts, E N,N-Diethyl-4-(phenylpiperidin-4-ylidenemethyl)benzamide: a novel, exceptionally selective, potent delta opioid receptor agonist with oral bioavailability and its analogues. J Med Chem43:3895-905 (2000) Delta-type opioid receptor
Name:Delta-type opioid receptor
Type:G Protein-Coupled Receptor (GPCR)
Mol. Mass.:40382.98
Organism:Homo sapiens (Human)
Description:Competition binding assays were carried out using membrane preparations from transfected HN9.10 cells that constitutively expressed the delta opioid receptor.
Residue:372
BDBM50092720
NameBDBM50092720
Synonyms:CHEMBL129315 | N,N-Diethyl-4-(piperidin-4-ylidene-thiophen-2-yl-methyl)-benzamide
TypeSmall organic molecule
Emp. Form.C21H26N2OS
Mol. Mass.354.509
SMILES[#6]-[#6]-[#7](-[#6]-[#6])-[#6](=O)-c1ccc(cc1)-[#6](\c1cccs1)=[#6]-1/[#6]-[#6]-[#7]-[#6]-[#6]-1