Reaction Details
TargetKappa-type opioid receptor
LigandBDBM50092709
Substrate/Competitorn/a
Meas. Tech.ChEMBL_145110 (CHEMBL857684)
IC50 8340±n/a nM
Citation Wei, ZYBrown, WTakasaki, BPlobeck, NDelorme, DZhou, FYang, HJones, PGawell, LGagnon, HSchmidt, RYue, SYWalpole, CPayza, KSt-Onge, SLabarre, MGodbout, CJakob, AButterworth, JKamassah, AMorin, PEProjean, DDucharme, JRoberts, E N,N-Diethyl-4-(phenylpiperidin-4-ylidenemethyl)benzamide: a novel, exceptionally selective, potent delta opioid receptor agonist with oral bioavailability and its analogues. J Med Chem43:3895-905 (2000) Kappa-type opioid receptor
Name:Kappa-type opioid receptor
Type:G Protein-Coupled Receptor (GPCR)
Mol. Mass.:42648.76
Organism:Homo sapiens (Human)
Description:P41145
Residue:380
BDBM50092709
NameBDBM50092709
Synonyms:4-[(4-Chloro-phenyl)-piperidin-4-ylidene-methyl]-N,N-diethyl-benzamide | CHEMBL127007
TypeSmall organic molecule
Emp. Form.C23H27ClN2O
Mol. Mass.382.926
SMILES[#6]-[#6]-[#7](-[#6]-[#6])-[#6](=O)-c1ccc(cc1)-[#6](=[#6]-1/[#6]-[#6]-[#7]-[#6]-[#6]-1)\c1ccc(Cl)cc1