Reaction Details
TargetLactoylglutathione lyase
LigandBDBM50092825
Substrate/Competitorn/a
Meas. Tech.ChEMBL_71287 (CHEMBL684991)
Ki 160±n/a nM
Citation Kalsi, AKavarana, MJLu, TWhalen, DLHamilton, DSCreighton, DJ Role of hydrophobic interactions in binding S-(N-aryl/alkyl-N-hydroxycarbamoyl)glutathiones to the active site of the antitumor target enzyme glyoxalase I. J Med Chem43:3981-6 (2000) Lactoylglutathione lyase
Name:Lactoylglutathione lyase
Type:Enzyme
Mol. Mass.:20772.95
Organism:Homo sapiens (Human)
Description:Q04760
Residue:184
BDBM50092825
NameBDBM50092825
Synonyms:CHEMBL128935 | S-(N-phenyl-N-hydroxycarbamoyl)glutathione
TypeSmall organic molecule
Emp. Form.C17H22N4O8S
Mol. Mass.442.444
SMILESN[C@@H](CCC(=O)N[C@@H](CSC(=O)N(O)c1ccccc1)C(=O)NCC(O)=O)C(O)=O