Reaction Details
TargetLactoylglutathione lyase
LigandBDBM50092826
Substrate/Competitorn/a
Meas. Tech.ChEMBL_149564 (CHEMBL757477)
Ki 10000±n/a nM
Citation Kalsi, AKavarana, MJLu, TWhalen, DLHamilton, DSCreighton, DJ Role of hydrophobic interactions in binding S-(N-aryl/alkyl-N-hydroxycarbamoyl)glutathiones to the active site of the antitumor target enzyme glyoxalase I. J Med Chem43:3981-6 (2000) Lactoylglutathione lyase
Name:Lactoylglutathione lyase
Type:Enzyme
Mol. Mass.:20772.95
Organism:Homo sapiens (Human)
Description:Q04760
Residue:184
BDBM50092826
NameBDBM50092826
Synonyms:(2S)-2-amino-5-{[(1R)-1-[({[(4-bromophenyl)(hydroxy)amino]carbonyl}thio)methyl]-2-(carboxyamino)-2-oxoethyl]amino}-5-oxopentanoic acid CHEMBL128872 | S-(N-4bromophenyl-N-hydroxycarbamoyl)glutathione
TypeSmall organic molecule
Emp. Form.C17H21BrN4O8S
Mol. Mass.521.34
SMILESN[C@@H](CCC(=O)N[C@@H](CSC(=O)N(O)c1ccc(Br)cc1)C(=O)NCC(O)=O)C(O)=O