Reaction Details
TargetLactoylglutathione lyase
LigandBDBM50092823
Substrate/Competitorn/a
Meas. Tech.ChEMBL_71287 (CHEMBL684991)
Ki 1700±n/a nM
Citation Kalsi, AKavarana, MJLu, TWhalen, DLHamilton, DSCreighton, DJ Role of hydrophobic interactions in binding S-(N-aryl/alkyl-N-hydroxycarbamoyl)glutathiones to the active site of the antitumor target enzyme glyoxalase I. J Med Chem43:3981-6 (2000) Lactoylglutathione lyase
Name:Lactoylglutathione lyase
Type:Enzyme
Mol. Mass.:20772.95
Organism:Homo sapiens (Human)
Description:Q04760
Residue:184
BDBM50092823
NameBDBM50092823
Synonyms:CHEMBL129435 | S-(N-methyl-N-hydroxycarbamoyl)glutathione
TypeSmall organic molecule
Emp. Form.C12H20N4O8S
Mol. Mass.380.374
SMILESCN(O)C(=O)SC[C@H](NC(=O)CC[C@H](N)C(O)=O)C(=O)NCC(O)=O