Reaction Details
TargetTranscription factor Jun
LigandBDBM50092869
Substrate/Competitorn/a
Meas. Tech.ChEMBL_28876 (CHEMBL645946)
IC50>10000±n/a nM
Citation Palanki, MSErdman, PEGayo-Fung, LMShevlin, GISullivan, RWGoldman, MERansone, LJBennett, BLManning, AMSuto, MJ Inhibitors of NF-kappaB and AP-1 gene expression: SAR studies on the pyrimidine portion of 2-chloro-4-trifluoromethylpyrimidine-5-[N-(3', 5'-bis(trifluoromethyl)phenyl)carboxamide]. J Med Chem43:3995-4004 (2000) Transcription factor Jun
Name:Transcription factor Jun
Type:n/a
Mol. Mass.:35683.24
Organism:Homo sapiens (Human)
Description:P05412
Residue:331
BDBM50092869
NameBDBM50092869
Synonyms:2-Chloro-6-methyl-pyrimidine-4-carboxylic acid (3,5-bis-trifluoromethyl-phenyl)-amide | CHEMBL131293
TypeSmall organic molecule
Emp. Form.C14H8ClF6N3O
Mol. Mass.383.676
SMILESCc1cc(nc(Cl)n1)C(=O)Nc1cc(cc(c1)C(F)(F)F)C(F)(F)F