Reaction Details
TargetMuscarinic acetylcholine receptor M1
LigandBDBM50092319
Substrate/Competitorn/a
Meas. Tech.ChEBML_138412
Ki 6±n/a nM
Citation Kozlowski, JALowe, DBGuzik, HSZhou, GRuperto, VBDuffy, RAMcQuade, RCrosby, GTaylor, LABillard, WBinch, HLachowicz, JE Diphenyl sulfoxides as selective antagonists of the muscarinic M2 receptor. Bioorg Med Chem Lett10:2255-7 (2001) Muscarinic acetylcholine receptor M1
Name:Muscarinic acetylcholine receptor M1
Type:Protein
Mol. Mass.:51442.54
Organism:Homo sapiens (Human)
Description:P11229
Residue:460
BDBM50092319
NameBDBM50092319
Synonyms:1-Cyclohexyl-4-{1-[4-(4-methoxy-benzenesulfinyl)-phenyl]-ethyl}-piperazine | CHEMBL307810
TypeSmall organic molecule
Emp. Form.C25H34N2O2S
Mol. Mass.426.615
SMILESCOc1ccc(cc1)S(=O)c1ccc(cc1)C(C)N1CCN(CC1)C1CCCCC1