Reaction Details
TargetMuscarinic acetylcholine receptor M2
LigandBDBM50451110
Substrate/Competitorn/a
Meas. Tech.ChEMBL_139763 (CHEMBL748899)
Ki 20.0±n/a nM
Citation Kozlowski, JALowe, DBGuzik, HSZhou, GRuperto, VBDuffy, RAMcQuade, RCrosby, GTaylor, LABillard, WBinch, HLachowicz, JE Diphenyl sulfoxides as selective antagonists of the muscarinic M2 receptor. Bioorg Med Chem Lett10:2255-7 (2001) Muscarinic acetylcholine receptor M2
Name:Muscarinic acetylcholine receptor M2
Type:GPCR
Mol. Mass.:51730.61
Organism:Homo sapiens (Human)
Description:P08172
Residue:466
BDBM50451110
NameBDBM50451110
Synonyms:CHEMBL2111540
TypeSmall organic molecule
Emp. Form.C25H31N3O2S
Mol. Mass.437.598
SMILESCOc1ccc(cc1)[S@@+]([O-])c1ccc(cc1)C(C#N)N1CCN(CC1)C1CCCCC1