Reaction Details
TargetBeta-1 adrenergic receptor
LigandBDBM50093039
Substrate/Competitorn/a
Meas. Tech.ChEMBL_37258 (CHEMBL650173)
EC50 2±n/a nM
Citation Parmee, ERBrockunier, LLHe, JSingh, SBCandelore, MRCascieri, MADeng, LLiu, YTota, LWyvratt, MJFisher, MHWeber, AE Tetrahydroisoquinoline derivatives containing a benzenesulfonamide moiety as potent, selective human beta3 adrenergic receptor agonists. Bioorg Med Chem Lett10:2283-6 (2001) Beta-1 adrenergic receptor
Name:Beta-1 adrenergic receptor
Type:G Protein-Coupled Receptor (GPCR)
Mol. Mass.:51338.40
Organism:Homo sapiens (Human)
Description:P08588
Residue:477
BDBM50093039
NameBDBM50093039
Synonyms:4-(3,5-Diiodo-4-methoxy-benzyl)-4,5,6,7-tetrahydro-thiazolo[5,4-c]pyridin-2-ylamine | CHEMBL307647
TypeSmall organic molecule
Emp. Form.C14H15I2N3OS
Mol. Mass.527.162
SMILESCOc1c(I)cc(CC2NCCc3nc(N)sc23)cc1I