Reaction Details
Target5-hydroxytryptamine receptor 6
LigandBDBM50093048
Substrate/Competitorn/a
Meas. Tech.ChEBML_3621
Ki 5±n/a nM
Citation Tsai, YDukat, MSlassi, AMacLean, NDemchyshyn, LSavage, JERoth, BLHufesein, SLee, MGlennon, RA N1-(Benzenesulfonyl)tryptamines as novel 5-HT6 antagonists. Bioorg Med Chem Lett10:2295-9 (2001) 5-hydroxytryptamine receptor 6
Name:5-hydroxytryptamine receptor 6
Type:G Protein-Coupled Receptor (GPCR)
Mol. Mass.:46968.43
Organism:Homo sapiens (Human)
Description:P50406
Residue:440
BDBM50093048
NameBDBM50093048
Synonyms:CHEMBL72554 | {2-[7-Methoxy-1-(naphthalene-2-sulfonyl)-1H-indol-3-yl]-ethyl}-dimethyl-amine
TypeSmall organic molecule
Emp. Form.C23H24N2O3S
Mol. Mass.408.513
SMILESCOc1cccc2c(CCN(C)C)cn(c12)S(=O)(=O)c1ccc2ccccc2c1