Reaction Details
Target5-hydroxytryptamine receptor 2A
LigandBDBM34141
Substrate/Competitorn/a
Meas. Tech.ChEBML_2653
Ki 130±n/a nM
Citation Tsai, YDukat, MSlassi, AMacLean, NDemchyshyn, LSavage, JERoth, BLHufesein, SLee, MGlennon, RA N1-(Benzenesulfonyl)tryptamines as novel 5-HT6 antagonists. Bioorg Med Chem Lett10:2295-9 (2001) 5-hydroxytryptamine receptor 2A
Name:5-hydroxytryptamine receptor 2A
Type:G Protein-Coupled Receptor (GPCR)
Mol. Mass.:52852.05
Organism:Rattus norvegicus (rat)
Description:Rat cortex membranes 5-HT2A receptors.
Residue:471
BDBM34141
NameBDBM34141
Synonyms:CHEMBL76237 | MS-245
TypeSmall organic molecule
Emp. Form.C19H22N2O3S
Mol. Mass.358.455
SMILESCOc1ccc2n(cc(CCN(C)C)c2c1)S(=O)(=O)c1ccccc1