Reaction Details
Target5-hydroxytryptamine receptor 6
LigandBDBM50093054
Substrate/Competitorn/a
Meas. Tech.ChEBML_3621
Ki 1.6±n/a nM
Citation Tsai, YDukat, MSlassi, AMacLean, NDemchyshyn, LSavage, JERoth, BLHufesein, SLee, MGlennon, RA N1-(Benzenesulfonyl)tryptamines as novel 5-HT6 antagonists. Bioorg Med Chem Lett10:2295-9 (2001) 5-hydroxytryptamine receptor 6
Name:5-hydroxytryptamine receptor 6
Type:G Protein-Coupled Receptor (GPCR)
Mol. Mass.:46968.43
Organism:Homo sapiens (Human)
Description:P50406
Residue:440
BDBM50093054
NameBDBM50093054
Synonyms:CHEMBL75010 | {2-[5-Methoxy-1-(naphthalene-2-sulfonyl)-1H-indol-3-yl]-ethyl}-dimethyl-amine
TypeSmall organic molecule
Emp. Form.C23H24N2O3S
Mol. Mass.408.513
SMILESCOc1ccc2n(cc(CCN(C)C)c2c1)S(=O)(=O)c1ccc2ccccc2c1