Reaction Details
TargetGrowth factor receptor-bound protein 2
LigandBDBM50093127
Substrate/Competitorn/a
Meas. Tech.ChEBML_63777
IC50 1200±n/a nM
Citation Furet, PCaravatti, GDenholm, AAFaessler, AFretz, HGarcía-Echeverría, CGay, BIrving, EPress, NJRahuel, JSchoepfer, JWalker, CV Structure-based design and synthesis of phosphinate isosteres of phosphotyrosine for incorporation in Grb2-SH2 domain inhibitors. Part 1. Bioorg Med Chem Lett10:2337-41 (2001) Growth factor receptor-bound protein 2
Name:Growth factor receptor-bound protein 2
Type:Protein
Mol. Mass.:25205.04
Organism:Homo sapiens (Human)
Description:P62993
Residue:217
BDBM50093127
NameBDBM50093127
Synonyms:(4-{(S)-2-Acetylamino-2-[1-((1R,2S)-2-carbamoyl-cyclohexylcarbamoyl)-cyclohexylcarbamoyl]-ethyl}-benzyl)-benzyl-phosphinic acid | CHEMBL78061
TypeSmall organic molecule
Emp. Form.C33H45N4O6P
Mol. Mass.624.7074
SMILESCC(=O)N[C@@H](Cc1ccc(CP(O)(=O)Cc2ccccc2)cc1)C(=O)NC1(CCCCC1)C(=O)N[C@@H]1CCCC[C@@H]1C(N)=O