Reaction Details
TargetTryptase beta-2
LigandBDBM50093132
Substrate/Competitorn/a
Meas. Tech.ChEBML_210829
Ki 2±n/a nM
Citation Rice, KDGangloff, ARKuo, EYDener, JMWang, VRLum, RNewcomb, WSHavel, CPutnam, DCregar, LWong, MWarne, RL Dibasic inhibitors of human mast cell tryptase. Part 1: synthesis and optimization of a novel class of inhibitors. Bioorg Med Chem Lett10:2357-60 (2001) Tryptase beta-2
Name:Tryptase beta-2
Type:PROTEIN
Mol. Mass.:30518.79
Organism:Homo sapiens (Human)
Description:ChEMBL_210702
Residue:275
BDBM50093132
NameBDBM50093132
Synonyms:CHEMBL75749 | [3-(4-Guanidino-benzyl)-ureido]-acetic acid 5-{2-[3-(4-guanidino-benzyl)-ureido]-acetoxy}-cyclooctyl ester
TypeSmall organic molecule
Emp. Form.C30H42N10O6
Mol. Mass.638.7179
SMILES[#7]\[#6](-[#7])=[#7]/c1ccc(-[#6]-[#7]-[#6](=O)-[#7]-[#6]-[#6](=O)-[#8]-[#6@H]-2-[#6]-[#6]-[#6]-[#6@H](-[#6]-[#6]-[#6]-2)-[#8]-[#6](=O)-[#6]-[#7]-[#6](=O)-[#7]-[#6]-c2ccc(cc2)\[#7]=[#6](\[#7])-[#7])cc1