Reaction Details
TargetTryptase beta-2/delta/gamma
LigandBDBM50093198
Substrate/Competitorn/a
Meas. Tech.ChEMBL_210830 (CHEMBL811859)
Ki 3±n/a nM
Citation Rice, KDWang, VRGangloff, ARKuo, EYDener, JMNewcomb, WSYoung, WBPutnam, DCregar, LWong, MSimpson, PJ Dibasic inhibitors of human mast cell tryptase. Part 2: structure-activity relationships and requirements for potent activity. Bioorg Med Chem Lett10:2361-6 (2001) Tryptase beta-2/delta/gamma
Name:Tryptase beta-2/delta/gamma
Synonyms:Tryptase
Type:n/a
Mol. Mass.:n/a
Description:ASSAY_ID of ChEMBL is 1510505
Components:This complex has 3 components.
Component 1
Name:Tryptase gamma
Type:PROTEIN
Mol. Mass.:33817.52
Organism:Homo sapiens (Human)
Description:ChEMBL_210833
Residue:321
Component 2
Name:Tryptase beta-2
Synonyms:TPS2 TRYB2_HUMAN Tryptase II Tryptase-2
Type:PROTEIN
Mol. Mass.:30518.79
Organism:Homo sapiens (Human)
Description:ChEMBL_210702
Residue:275
Component 3
Name:Tryptase delta
Synonyms:Delta-tryptase Mast cell mMCP-7-like TRYD_HUMAN Tryptase-3
Type:PROTEIN
Mol. Mass.:26578.73
Organism:Homo sapiens (Human)
Description:ChEMBL_104777
Residue:242
BDBM50093198
NameBDBM50093198
Synonyms:CHEMBL311043 | Derivative of piperazine-1-carboxylic acid 5-(piperazine-1-carbonyloxy)-cyclooctyl ester
TypeSmall organic molecule
Emp. Form.C35H56N10O6
Mol. Mass.712.8825
SMILES[#7]\[#6](-[#7])=[#7]/c1ccc(-[#6]-[#7]-[#6](=O)-[#7]-2-[#6]-[#6]-[#7](-[#6]-[#6]-2)-[#6](=O)-[#8]-[#6@@H]-2-[#6]-[#6]-[#6]-[#6@@H](-[#6]-[#6]-[#6]-2)-[#8]-[#6](=O)-[#7]-2-[#6]-[#6]-[#7](-[#6]-[#6]-2)-[#6](=O)-[#7]-[#6]-[#6]-[#6]-2-[#6]-[#6]-[#7]-[#6]-[#6]-2)cc1