Reaction Details
TargetMelatonin receptor type 1A
LigandBDBM50093273
Substrate/Competitorn/a
Meas. Tech.ChEMBL_104944 (CHEMBL713111)
Ki 0.1±n/a nM
Citation Jellimann, CMathé-Allainmat, MAndrieux, JKloubert, SBoutin, JANicolas, JPBennejean, CDelagrange, PLanglois, M Synthesis of phenalene and acenaphthene derivatives as new conformationally restricted ligands for melatonin receptors. J Med Chem43:4051-62 (2000) Melatonin receptor type 1A
Name:Melatonin receptor type 1A
Type:Enzyme
Mol. Mass.:39392.94
Organism:Homo sapiens (Human)
Description:P48039
Residue:350
BDBM50093273
NameBDBM50093273
Synonyms:CHEMBL130542 | N-(8-Methoxy-acenaphthen-1-ylmethyl)-propionamide
TypeSmall organic molecule
Emp. Form.C17H19NO2
Mol. Mass.269.3383
SMILESCCC(=O)NCC1Cc2cccc3ccc(OC)c1c23