Reaction Details
TargetMelatonin receptor type 1B
LigandBDBM50093275
Substrate/Competitorn/a
Meas. Tech.ChEMBL_105244 (CHEMBL712574)
Ki 0.094±n/a nM
Citation Jellimann, CMathé-Allainmat, MAndrieux, JKloubert, SBoutin, JANicolas, JPBennejean, CDelagrange, PLanglois, M Synthesis of phenalene and acenaphthene derivatives as new conformationally restricted ligands for melatonin receptors. J Med Chem43:4051-62 (2000) Melatonin receptor type 1B
Name:Melatonin receptor type 1B
Type:Enzyme
Mol. Mass.:40203.54
Organism:Homo sapiens (Human)
Description:P49286
Residue:362
BDBM50093275
NameBDBM50093275
Synonyms:CHEMBL132802 | N-(9-Methoxy-2,3-dihydro-1H-phenalen-1-ylmethyl)-acetamide
TypeSmall organic molecule
Emp. Form.C17H19NO2
Mol. Mass.269.3383
SMILESCOc1ccc2cccc3CCC(CNC(C)=O)c1c23