Reaction Details
TargetMelatonin receptor type 1B
LigandBDBM50093280
Substrate/Competitorn/a
Meas. Tech.ChEMBL_105244 (CHEMBL712574)
Ki 0.093±n/a nM
Citation Jellimann, CMathé-Allainmat, MAndrieux, JKloubert, SBoutin, JANicolas, JPBennejean, CDelagrange, PLanglois, M Synthesis of phenalene and acenaphthene derivatives as new conformationally restricted ligands for melatonin receptors. J Med Chem43:4051-62 (2000) Melatonin receptor type 1B
Name:Melatonin receptor type 1B
Type:Enzyme
Mol. Mass.:40203.54
Organism:Homo sapiens (Human)
Description:P49286
Residue:362
BDBM50093280
NameBDBM50093280
Synonyms:CHEMBL337882 | N-Acenaphthen-1-ylmethyl-butyramide
TypeSmall organic molecule
Emp. Form.C17H19NO
Mol. Mass.253.3389
SMILESCCCC(=O)NCC1Cc2cccc3cccc1c23