Reaction Details
TargetProthrombin
LigandBDBM50093299
Substrate/Competitorn/a
Meas. Tech.ChEMBL_208726 (CHEMBL809417)
IC50 2200±n/a nM
Citation Dudley, DABunker, AMChi, LCody, WLHolland, DRIgnasiak, DPJaniczek-Dolphin, NMcClanahan, TBMertz, TENarasimhan, LSRapundalo, STTrautschold, JAVan Huis, CAEdmunds, JJ Rational design, synthesis, and biological activity of benzoxazinones as novel factor Xa inhibitors. J Med Chem43:4063-70 (2000) Prothrombin
Name:Prothrombin
Type:Protein
Mol. Mass.:70029.57
Organism:Homo sapiens (Human)
Description:P00734
Residue:622
BDBM50093299
NameBDBM50093299
Synonyms:3-[4-(5-Morpholin-4-yl-pentyl)-3-oxo-3,4-dihydro-2H-benzo[1,4]oxazin-2-yl]-benzamidine | CHEMBL130378
TypeSmall organic molecule
Emp. Form.C24H30N4O3
Mol. Mass.422.52
SMILESNC(=N)c1cccc(c1)C1Oc2ccccc2N(CCCCCN2CCOCC2)C1=O