Reaction Details
TargetCoagulation factor X
LigandBDBM50093317
Substrate/Competitorn/a
Meas. Tech.ChEMBL_48967 (CHEMBL661678)
IC50 6300±n/a nM
Citation Dudley, DABunker, AMChi, LCody, WLHolland, DRIgnasiak, DPJaniczek-Dolphin, NMcClanahan, TBMertz, TENarasimhan, LSRapundalo, STTrautschold, JAVan Huis, CAEdmunds, JJ Rational design, synthesis, and biological activity of benzoxazinones as novel factor Xa inhibitors. J Med Chem43:4063-70 (2000) Coagulation factor X
Name:Coagulation factor X
Type:Enzyme
Mol. Mass.:54726.60
Organism:Homo sapiens (Human)
Description:n/a
Residue:488
BDBM50093317
NameBDBM50093317
Synonyms:3-[4-(5-Amino-pentyl)-3-oxo-3,4-dihydro-2H-benzo[1,4]oxazin-2-yl]-benzamidine | CHEMBL133171
TypeSmall organic molecule
Emp. Form.C20H24N4O2
Mol. Mass.352.4302
SMILESNCCCCCN1C(=O)C(Oc2ccccc12)c1cccc(c1)C(N)=N