Reaction Details
TargetCoagulation factor X
LigandBDBM50093313
Substrate/Competitorn/a
Meas. Tech.ChEMBL_48967 (CHEMBL661678)
IC50 53.0±n/a nM
Citation Dudley, DABunker, AMChi, LCody, WLHolland, DRIgnasiak, DPJaniczek-Dolphin, NMcClanahan, TBMertz, TENarasimhan, LSRapundalo, STTrautschold, JAVan Huis, CAEdmunds, JJ Rational design, synthesis, and biological activity of benzoxazinones as novel factor Xa inhibitors. J Med Chem43:4063-70 (2000) Coagulation factor X
Name:Coagulation factor X
Type:Enzyme
Mol. Mass.:54726.60
Organism:Homo sapiens (Human)
Description:n/a
Residue:488
BDBM50093313
NameBDBM50093313
Synonyms:3-[3-Oxo-4-(5-piperidin-1-yl-pentyl)-3,4-dihydro-2H-benzo[1,4]oxazin-2-yl]-benzamidine | CHEMBL341187
TypeSmall organic molecule
Emp. Form.C25H32N4O2
Mol. Mass.420.5472
SMILESNC(=N)c1cccc(c1)C1Oc2ccccc2N(CCCCCN2CCCCC2)C1=O