Reaction Details
TargetMethylated-DNA--protein-cysteine methyltransferase
LigandBDBM50093328
Substrate/Competitorn/a
Meas. Tech.ChEMBL_28279 (CHEMBL645820)
IC50 550±n/a nM
Citation Griffin, RJArris, CEBleasdale, CBoyle, FTCalvert, AHCurtin, NJDalby, CKanugula, SLembicz, NKNewell, DRPegg, AEGolding, BT Resistance-modifying agents. 8. Inhibition of O(6)-alkylguanine-DNA alkyltransferase by O(6)-alkenyl-, O(6)-cycloalkenyl-, and O(6)-(2-oxoalkyl)guanines and potentiation of temozolomide cytotoxicity in vitro by O(6)-(1-cyclopentenylmethyl)guanine. J Med Chem43:4071-83 (2000) Methylated-DNA--protein-cysteine methyltransferase
Name:Methylated-DNA--protein-cysteine methyltransferase
Type:PROTEIN
Mol. Mass.:21651.27
Organism:Homo sapiens (Human)
Description:ChEMBL_144711
Residue:207
BDBM50093328
NameBDBM50093328
Synonyms:6-(Cyclobut-1-enylmethoxy)-9H-purin-2-ylamine | CHEMBL439608
TypeSmall organic molecule
Emp. Form.C10H11N5O
Mol. Mass.217.2272
SMILESNc1nc(OCC2=CCC2)c2[nH]cnc2n1