Reaction Details
TargetPoly [ADP-ribose] polymerase 1
LigandBDBM50093365
Substrate/Competitorn/a
Meas. Tech.ChEMBL_151867 (CHEMBL759581)
Ki 5.9±n/a nM
Citation White, AWAlmassy, RCalvert, AHCurtin, NJGriffin, RJHostomsky, ZMaegley, KNewell, DRSrinivasan, SGolding, BT Resistance-modifying agents. 9. Synthesis and biological properties of benzimidazole inhibitors of the DNA repair enzyme poly(ADP-ribose) polymerase. J Med Chem43:4084-97 (2000) Poly [ADP-ribose] polymerase 1
Name:Poly [ADP-ribose] polymerase 1
Type:n/a
Mol. Mass.:113114.22
Organism:Homo sapiens (Human)
Description:P09874
Residue:1014
BDBM50093365
NameBDBM50093365
Synonyms:2-Benzo[1,3]dioxol-5-yl-1H-benzoimidazole-4-carboxylic acid amide | CHEMBL337386
TypeSmall organic molecule
Emp. Form.C15H11N3O3
Mol. Mass.281.2661
SMILESNC(=O)c1cccc2[nH]c(nc12)-c1ccc2OCOc2c1