Reaction Details
TargetPoly [ADP-ribose] polymerase 1
LigandBDBM50093384
Substrate/Competitorn/a
Meas. Tech.ChEMBL_151867 (CHEMBL759581)
Ki 2±n/a nM
Citation White, AWAlmassy, RCalvert, AHCurtin, NJGriffin, RJHostomsky, ZMaegley, KNewell, DRSrinivasan, SGolding, BT Resistance-modifying agents. 9. Synthesis and biological properties of benzimidazole inhibitors of the DNA repair enzyme poly(ADP-ribose) polymerase. J Med Chem43:4084-97 (2000) Poly [ADP-ribose] polymerase 1
Name:Poly [ADP-ribose] polymerase 1
Type:n/a
Mol. Mass.:113114.22
Organism:Homo sapiens (Human)
Description:P09874
Residue:1014
BDBM50093384
NameBDBM50093384
Synonyms:2-(3-Hydroxy-4-methoxy-phenyl)-1H-benzoimidazole-4-carboxylic acid amide | CHEMBL338923
TypeSmall organic molecule
Emp. Form.C15H13N3O3
Mol. Mass.283.282
SMILESCOc1ccc(cc1O)-c1nc2c(cccc2[nH]1)C(N)=O