Reaction Details
TargetAldehyde dehydrogenase, mitochondrial
LigandBDBM50093538
Substrate/Competitorn/a
Meas. Tech.ChEMBL_28556 (CHEMBL641008)
IC50 40±n/a nM
Citation Rooke, NLi, DJLi, JKeung, WM The mitochondrial monoamine oxidase-aldehyde dehydrogenase pathway: a potential site of action of daidzin. J Med Chem43:4169-79 (2000) Aldehyde dehydrogenase, mitochondrial
Name:Aldehyde dehydrogenase, mitochondrial
Type:Enzyme
Mol. Mass.:56382.67
Organism:Homo sapiens (Human)
Description:P05091
Residue:517
BDBM50093538
NameBDBM50093538
Synonyms:3-(4-Hydroxyphenyl)-7-ethoxychromen-4-one 7-ethoxy-3-(4-hydroxyphenyl)-4H-chromen-4-one | CHEMBL115092
TypeSmall organic molecule
Emp. Form.C17H14O4
Mol. Mass.282.2907
SMILESCCOc1ccc2c(c1)occ(-c1ccc(O)cc1)c2=O