Reaction Details
TargetCalpain small subunit 1
LigandBDBM50093805
Substrate/Competitorn/a
Meas. Tech.ChEBML_43687
Ki 70.0±n/a nM
Citation Donkor, IOZheng, XMiller, DD Synthesis and calpain inhibitory activity of alpha-ketoamides with 2,3-methanoleucine stereoisomers at the P2 position. Bioorg Med Chem Lett10:2497-500 (2001) Calpain small subunit 1
Name:Calpain small subunit 1
Type:PROTEIN
Mol. Mass.:28062.13
Organism:Sus scrofa
Description:ChEMBL_43862
Residue:266
BDBM50093805
NameBDBM50093805
Synonyms:CHEMBL416281 | [(S)-1-((S)-1-Benzyl-2-oxo-2-phenethylcarbamoyl-ethylcarbamoyl)-3-methyl-butyl]-carbamic acid benzyl ester
TypeSmall organic molecule
Emp. Form.C32H37N3O5
Mol. Mass.543.6533
SMILESCC(C)C[C@H](NC(=O)OCc1ccccc1)C(=O)N[C@@H](Cc1ccccc1)C(=O)C(=O)NCCc1ccccc1