Reaction Details
TargetCalpain small subunit 1
LigandBDBM50093803
Substrate/Competitorn/a
Meas. Tech.ChEBML_43687
Ki 750±n/a nM
Citation Donkor, IOZheng, XMiller, DD Synthesis and calpain inhibitory activity of alpha-ketoamides with 2,3-methanoleucine stereoisomers at the P2 position. Bioorg Med Chem Lett10:2497-500 (2001) Calpain small subunit 1
Name:Calpain small subunit 1
Type:PROTEIN
Mol. Mass.:28062.13
Organism:Sus scrofa
Description:ChEMBL_43862
Residue:266
BDBM50093803
NameBDBM50093803
Synonyms:CHEMBL316201 | [(1S,2S)-1-((S)-1-Benzyl-2-oxo-2-phenethylcarbamoyl-ethylcarbamoyl)-2-isopropyl-cyclopropyl]-carbamic acid benzyl ester
TypeSmall organic molecule
Emp. Form.C33H37N3O5
Mol. Mass.555.664
SMILESCC(C)[C@@H]1C[C@@]1(NC(=O)OCc1ccccc1)C(=O)N[C@@H](Cc1ccccc1)C(=O)C(=O)NCCc1ccccc1