Reaction Details
TargetPlatelet-activating factor acetylhydrolase
LigandBDBM50093935
Substrate/Competitorn/a
Meas. Tech.ChEBML_101010
IC50 1±n/a nM
Citation Boyd, HFFell, SCFlynn, STHickey, DMIfe, RJLeach, CAMacphee, CHMilliner, KJMoores, KEPinto, ILPorter, RARawlings, DASmith, SAStansfield, IGTew, DGTheobald, CJWhittaker, CM N-1 substituted pyrimidin-4-ones: novel, orally active inhibitors of lipoprotein-associated phospholipase A2. Bioorg Med Chem Lett10:2557-61 (2001) Platelet-activating factor acetylhydrolase
Name:Platelet-activating factor acetylhydrolase
Type:PROTEIN
Mol. Mass.:50084.41
Organism:Homo sapiens (Human)
Description:ChEMBL_156212
Residue:441
BDBM50093935
NameBDBM50093935
Synonyms:CHEMBL87741 | N-Dodecyl-2-[2-(4-fluoro-benzylsulfanyl)-4-oxo-5-pyrimidin-5-ylmethyl-4H-pyrimidin-1-yl]-N-methyl-acetamide
TypeSmall organic molecule
Emp. Form.C31H42FN5O2S
Mol. Mass.567.761
SMILESCCCCCCCCCCCCN(C)C(=O)Cn1cc(Cc2cncnc2)c(=O)nc1SCc1ccc(F)cc1