Reaction Details
TargetPlatelet-activating factor acetylhydrolase
LigandBDBM50403797
Substrate/Competitorn/a
Meas. Tech.ChEBML_101010
IC50 1±n/a nM
Citation Boyd, HFFell, SCFlynn, STHickey, DMIfe, RJLeach, CAMacphee, CHMilliner, KJMoores, KEPinto, ILPorter, RARawlings, DASmith, SAStansfield, IGTew, DGTheobald, CJWhittaker, CM N-1 substituted pyrimidin-4-ones: novel, orally active inhibitors of lipoprotein-associated phospholipase A2. Bioorg Med Chem Lett10:2557-61 (2001) Platelet-activating factor acetylhydrolase
Name:Platelet-activating factor acetylhydrolase
Type:PROTEIN
Mol. Mass.:50084.41
Organism:Homo sapiens (Human)
Description:ChEMBL_156212
Residue:441
BDBM50403797
NameBDBM50403797
Synonyms:CHEMBL2111561
TypeSmall organic molecule
Emp. Form.C36H50FN5O2S
Mol. Mass.635.878
SMILESCCCCCCCC\C=C/CCCCCCCCNC(=O)Cn1cc(Cc2cncnc2)c(=O)nc1SCc1ccc(F)cc1