Reaction Details
TargetKappa-type opioid receptor
LigandBDBM50093964
Substrate/Competitorn/a
Meas. Tech.ChEBML_145268
Ki 0.064000±n/a nM
Citation Kumar, VMarella, MACortes-Burgos, LChang, ACCassel, JADaubert, JDDeHaven, RNDeHaven-Hudkins, DLGottshall, SLMansson, EMaycock, AL Arylacetamides as peripherally restricted kappa opioid receptor agonists. Bioorg Med Chem Lett10:2567-70 (2001) Kappa-type opioid receptor
Name:Kappa-type opioid receptor
Type:G Protein-Coupled Receptor (GPCR)
Mol. Mass.:42648.76
Organism:Homo sapiens (Human)
Description:P41145
Residue:380
BDBM50093964
NameBDBM50093964
Synonyms:CHEMBL313484 | N-Methyl-N-((S)-1-phenyl-2-pyrrolidin-1-yl-ethyl)-2-(3-trifluoromethyl-phenyl)-acetamide
TypeSmall organic molecule
Emp. Form.C22H25F3N2O
Mol. Mass.390.4419
SMILESCN([C@H](CN1CCCC1)c1ccccc1)C(=O)Cc1cccc(c1)C(F)(F)F