Reaction Details
TargetKappa-type opioid receptor
LigandBDBM50093967
Substrate/Competitorn/a
Meas. Tech.ChEBML_145268
Ki 0.930000±n/a nM
Citation Kumar, VMarella, MACortes-Burgos, LChang, ACCassel, JADaubert, JDDeHaven, RNDeHaven-Hudkins, DLGottshall, SLMansson, EMaycock, AL Arylacetamides as peripherally restricted kappa opioid receptor agonists. Bioorg Med Chem Lett10:2567-70 (2001) Kappa-type opioid receptor
Name:Kappa-type opioid receptor
Type:G Protein-Coupled Receptor (GPCR)
Mol. Mass.:42648.76
Organism:Homo sapiens (Human)
Description:P41145
Residue:380
BDBM50093967
NameBDBM50093967
Synonyms:2-(3-Amino-phenyl)-N-methyl-N-((S)-1-phenyl-2-pyrrolidin-1-yl-ethyl)-acetamide | CHEMBL87483
TypeSmall organic molecule
Emp. Form.C21H27N3O
Mol. Mass.337.4586
SMILESCN([C@H](CN1CCCC1)c1ccccc1)C(=O)Cc1cccc(N)c1