Reaction Details
TargetKappa-type opioid receptor
LigandBDBM50093970
Substrate/Competitorn/a
Meas. Tech.ChEBML_145268
Ki 0.096000±n/a nM
Citation Kumar, VMarella, MACortes-Burgos, LChang, ACCassel, JADaubert, JDDeHaven, RNDeHaven-Hudkins, DLGottshall, SLMansson, EMaycock, AL Arylacetamides as peripherally restricted kappa opioid receptor agonists. Bioorg Med Chem Lett10:2567-70 (2001) Kappa-type opioid receptor
Name:Kappa-type opioid receptor
Type:G Protein-Coupled Receptor (GPCR)
Mol. Mass.:42648.76
Organism:Homo sapiens (Human)
Description:P41145
Residue:380
BDBM50093970
NameBDBM50093970
Synonyms:2-(3,4-Dichloro-2-dimethanesulfonylamino-phenyl)-N-methyl-N-((S)-1-phenyl-2-pyrrolidin-1-yl-ethyl)-acetamide | CHEMBL424609
TypeSmall organic molecule
Emp. Form.C23H29Cl2N3O5S2
Mol. Mass.562.529
SMILESCN([C@H](CN1CCCC1)c1ccccc1)C(=O)Cc1ccc(Cl)c(Cl)c1N(S(C)(=O)=O)S(C)(=O)=O