Reaction Details
TargetEndothelin receptor type B
LigandBDBM50093984
Substrate/Competitorn/a
Meas. Tech.ChEBML_64040
IC50 3.3±n/a nM
Citation Zhang, JDidierlaurent, SFortin, MLefrançois, DUridat, EVevert, JP Potent nonpeptide endothelin antagonists: synthesis and structure-activity relationships of pyrazole-5-carboxylic acids. Bioorg Med Chem Lett10:2575-8 (2001) Endothelin receptor type B
Name:Endothelin receptor type B
Type:Enzyme Catalytic Domain
Mol. Mass.:49483.43
Organism:RAT
Description:ENDOTHELIN B EDNRB RAT::P21451
Residue:442
BDBM50093984
NameBDBM50093984
Synonyms:2-(2-Carboxymethoxy-benzyl)-4-(6-chloro-benzo[1,3]dioxol-5-ylmethyl)-5-phenyl-2H-pyrazole-3-carboxylic acid | CHEMBL315280
TypeSmall organic molecule
Emp. Form.C27H21ClN2O7
Mol. Mass.520.918
SMILESOC(=O)COc1ccccc1Cn1nc(c(Cc2cc3OCOc3cc2Cl)c1C(O)=O)-c1ccccc1