Reaction Details
TargetEndothelin-1 receptor
LigandBDBM50093981
Substrate/Competitorn/a
Meas. Tech.ChEBML_63349
IC50 15±n/a nM
Citation Zhang, JDidierlaurent, SFortin, MLefrançois, DUridat, EVevert, JP Potent nonpeptide endothelin antagonists: synthesis and structure-activity relationships of pyrazole-5-carboxylic acids. Bioorg Med Chem Lett10:2575-8 (2001) Endothelin-1 receptor
Name:Endothelin-1 receptor
Type:Enzyme Catalytic Domain
Mol. Mass.:48256.91
Organism:RAT
Description:ENDOTHELIN A EDNRA RAT::P26684
Residue:426
BDBM50093981
NameBDBM50093981
Synonyms:2-(2-Carboxymethoxy-4-methoxy-benzyl)-4-(6-chloro-benzo[1,3]dioxol-5-ylmethyl)-5-thiophen-2-yl-2H-pyrazole-3-carboxylic acid | CHEMBL314206
TypeSmall organic molecule
Emp. Form.C26H21ClN2O8S
Mol. Mass.556.972
SMILESCOc1ccc(Cn2nc(c(Cc3cc4OCOc4cc3Cl)c2C(O)=O)-c2cccs2)c(OCC(O)=O)c1