Reaction Details
TargetEndothelin receptor type B
LigandBDBM50094000
Substrate/Competitorn/a
Meas. Tech.ChEBML_64040
IC50 9.9±n/a nM
Citation Zhang, JDidierlaurent, SFortin, MLefrançois, DUridat, EVevert, JP Potent nonpeptide endothelin antagonists: synthesis and structure-activity relationships of pyrazole-5-carboxylic acids. Bioorg Med Chem Lett10:2575-8 (2001) Endothelin receptor type B
Name:Endothelin receptor type B
Type:Enzyme Catalytic Domain
Mol. Mass.:49483.43
Organism:RAT
Description:ENDOTHELIN B EDNRB RAT::P21451
Residue:442
BDBM50094000
NameBDBM50094000
Synonyms:2-(3-Carboxy-cyclohexylmethyl)-4-(6-chloro-benzo[1,3]dioxol-5-ylmethyl)-5-thiophen-2-yl-2H-pyrazole-3-carboxylic acid | CHEMBL88011
TypeSmall organic molecule
Emp. Form.C24H23ClN2O6S
Mol. Mass.502.967
SMILESOC(=O)C1CCCC(Cn2nc(c(Cc3cc4OCOc4cc3Cl)c2C(O)=O)-c2cccs2)C1