Reaction Details
TargetEndothelin-1 receptor
LigandBDBM50094004
Substrate/Competitorn/a
Meas. Tech.ChEBML_63349
IC50 4.7±n/a nM
Citation Zhang, JDidierlaurent, SFortin, MLefrançois, DUridat, EVevert, JP Potent nonpeptide endothelin antagonists: synthesis and structure-activity relationships of pyrazole-5-carboxylic acids. Bioorg Med Chem Lett10:2575-8 (2001) Endothelin-1 receptor
Name:Endothelin-1 receptor
Type:Enzyme Catalytic Domain
Mol. Mass.:48256.91
Organism:RAT
Description:ENDOTHELIN A EDNRA RAT::P26684
Residue:426
BDBM50094004
NameBDBM50094004
Synonyms:4-(6-Chloro-benzo[1,3]dioxol-5-ylmethyl)-2-cyclohexylmethyl-5-pyridin-2-yl-2H-pyrazole-3-carboxylic acid | CHEMBL314454
TypeSmall organic molecule
Emp. Form.C24H24ClN3O4
Mol. Mass.453.918
SMILESOC(=O)c1c(Cc2cc3OCOc3cc2Cl)c(nn1CC1CCCCC1)-c1ccccn1