Reaction Details
TargetGrowth hormone secretagogue receptor type 1
LigandBDBM50094051
Substrate/Competitorn/a
Meas. Tech.ChEMBL_72514 (CHEMBL685179)
IC50 8±n/a nM
Citation Bednarek, MAFeighner, SDPong, SSMcKee, KKHreniuk, DLSilva, MVWarren, VAHoward, ADVan Der Ploeg, LHHeck, JV Structure-function studies on the new growth hormone-releasing peptide, ghrelin: minimal sequence of ghrelin necessary for activation of growth hormone secretagogue receptor 1a. J Med Chem43:4370-6 (2000) Growth hormone secretagogue receptor type 1
Name:Growth hormone secretagogue receptor type 1
Type:Receptor
Mol. Mass.:41334.57
Organism:Homo sapiens (Human)
Description:Receptor binding studies use plasma membranes from LLC PK-1 cells transiently transfected with hGHSR1a.
Residue:366
BDBM50094051
NameBDBM50094051
Synonyms:CHEMBL412565 | GSS(heptyl carboxamide)FLSPEHQRVQQRKESKKPPAKLQPR
TypeSmall organic molecule
Emp. Form.C76H121N23O23
Mol. Mass.1724.9142
SMILESCCCCCCCC(=O)NC[C@H](NC(=O)[C@H](CO)NC(=O)CN)C(=O)N[C@@H](Cc1ccccc1)C(=O)N[C@@H](CC(C)C)C(=O)N[C@@H](CO)C(=O)N1CCC[C@@H]1C(=O)N[C@@H](CCC(O)=O)C(=O)N[C@@H](Cc1cnc[nH]1)C(=O)N[C@@H](CCC(N)=O)C(=O)N[C@@H](CCCNC(N)=N)C(=O)N[C@@H](C(C)C)C(=O)N[C@@H](CCC(N)=O)C(=O)N[C@@H](CCC(N)=O)C(O)=O