Reaction Details
TargetCoagulation factor X
LigandBDBM50094092
Substrate/Competitorn/a
Meas. Tech.ChEMBL_48949 (CHEMBL661662)
Ki 0.9±n/a nM
Citation Han, QDominguez, CStouten, PFPark, JMDuffy, DEGalemmo, RARossi, KAAlexander, RSSmallwood, AMWong, PCWright, MMLuettgen, JMKnabb, RMWexler, RR Design, synthesis, and biological evaluation of potent and selective amidino bicyclic factor Xa inhibitors. J Med Chem43:4398-415 (2000) Coagulation factor X
Name:Coagulation factor X
Type:Enzyme
Mol. Mass.:54726.60
Organism:Homo sapiens (Human)
Description:n/a
Residue:488
BDBM50094092
NameBDBM50094092
Synonyms:CHEMBL336661 | N-(3-Bromo-2'-sulfamoyl-biphenyl-4-yl)-2-(5-carbamimidoyl-1H-indol-3-yl)-acetamide
TypeSmall organic molecule
Emp. Form.C23H20BrN5O3S
Mol. Mass.526.406
SMILESNC(=N)c1ccc2[nH]cc(CC(=O)Nc3ccc(cc3Br)-c3ccccc3S(N)(=O)=O)c2c1