Reaction Details
TargetCoagulation factor X
LigandBDBM50094114
Substrate/Competitorn/a
Meas. Tech.ChEMBL_48664 (CHEMBL657716)
Ki 2.4±n/a nM
Citation Han, QDominguez, CStouten, PFPark, JMDuffy, DEGalemmo, RARossi, KAAlexander, RSSmallwood, AMWong, PCWright, MMLuettgen, JMKnabb, RMWexler, RR Design, synthesis, and biological evaluation of potent and selective amidino bicyclic factor Xa inhibitors. J Med Chem43:4398-415 (2000) Coagulation factor X
Name:Coagulation factor X
Type:Enzyme
Mol. Mass.:54726.60
Organism:Homo sapiens (Human)
Description:n/a
Residue:488
BDBM50094114
NameBDBM50094114
Synonyms:2-(6-Carbamimidoyl-benzoimidazol-1-yl)-N-(2'-sulfamoyl-biphenyl-4-yl)-acetamide | CHEMBL343495
TypeSmall organic molecule
Emp. Form.C22H20N6O3S
Mol. Mass.448.498
SMILESNC(=N)c1ccc2ncn(CC(=O)Nc3ccc(cc3)-c3ccccc3S(N)(=O)=O)c2c1