Reaction Details
TargetSteroid 17-alpha-hydroxylase/17,20 lyase
LigandBDBM50409039
Substrate/Competitorn/a
Meas. Tech.ChEMBL_50365 (CHEMBL661708)
Ki 3±n/a nM
Citation Hartmann, RWHector, MWachall, BGPalusczak, APalzer, MHuch, VVeith, M Synthesis and evaluation of 17-aliphatic heterocycle-substituted steroidal inhibitors of 17alpha-hydroxylase/C17-20-lyase (P450 17). J Med Chem43:4437-45 (2000) Steroid 17-alpha-hydroxylase/17,20 lyase
Name:Steroid 17-alpha-hydroxylase/17,20 lyase
Type:Enzyme
Mol. Mass.:57382.42
Organism:Homo sapiens (Human)
Description:E.coli expressing human CYP17
Residue:508
BDBM50409039
NameBDBM50409039
Synonyms:CHEMBL2111951
TypeSmall organic molecule
Emp. Form.C21H31NO
Mol. Mass.313.4769
SMILESC[C@]12CC[C@H]3[C@@H](CC=C4C[C@@H](O)CC[C@]34C)C1=CC[C@@H]2[C@H]1CN1