Reaction Details
TargetNociceptin receptor
LigandBDBM50094640
Substrate/Competitorn/a
Meas. Tech.ChEMBL_146120 (CHEMBL754589)
Ki 1.8±n/a nM
Citation Shinkai, HIto, TIida, TKitao, YYamada, HUchida, I 4-Aminoquinolines: novel nociceptin antagonists with analgesic activity. J Med Chem43:4667-77 (2001) Nociceptin receptor
Name:Nociceptin receptor
Type:G Protein-Coupled Receptor (GPCR)
Mol. Mass.:40702.87
Organism:Homo sapiens (Human)
Description:P41146
Residue:370
BDBM50094640
NameBDBM50094640
Synonyms:CHEMBL140640 | N-(4-Amino-2-propyl-quinolin-6-yl)-2-(4-chloro-phenoxymethyl)-benzamide
TypeSmall organic molecule
Emp. Form.C26H24ClN3O2
Mol. Mass.445.941
SMILESCCCc1cc(N)c2cc(NC(=O)c3ccccc3COc3ccc(Cl)cc3)ccc2n1