Reaction Details
TargetNociceptin receptor
LigandBDBM50094643
Substrate/Competitorn/a
Meas. Tech.ChEMBL_146120 (CHEMBL754589)
Ki 80±n/a nM
Citation Shinkai, HIto, TIida, TKitao, YYamada, HUchida, I 4-Aminoquinolines: novel nociceptin antagonists with analgesic activity. J Med Chem43:4667-77 (2001) Nociceptin receptor
Name:Nociceptin receptor
Type:G Protein-Coupled Receptor (GPCR)
Mol. Mass.:40702.87
Organism:Homo sapiens (Human)
Description:P41146
Residue:370
BDBM50094643
NameBDBM50094643
Synonyms:CHEMBL358306 | N-(4-Amino-2-methyl-quinolin-6-yl)-2-phenethyl-benzamide
TypeSmall organic molecule
Emp. Form.C25H23N3O
Mol. Mass.381.4696
SMILESCc1cc(N)c2cc(NC(=O)c3ccccc3CCc3ccccc3)ccc2n1