Reaction Details
TargetNociceptin receptor
LigandBDBM50094646
Substrate/Competitorn/a
Meas. Tech.ChEMBL_146120 (CHEMBL754589)
Ki 6.5±n/a nM
Citation Shinkai, HIto, TIida, TKitao, YYamada, HUchida, I 4-Aminoquinolines: novel nociceptin antagonists with analgesic activity. J Med Chem43:4667-77 (2001) Nociceptin receptor
Name:Nociceptin receptor
Type:G Protein-Coupled Receptor (GPCR)
Mol. Mass.:40702.87
Organism:Homo sapiens (Human)
Description:P41146
Residue:370
BDBM50094646
NameBDBM50094646
Synonyms:CHEMBL139934 | N-(4-Amino-2-methyl-quinolin-6-yl)-2-(4-chloro-phenoxymethyl)-N-methyl-benzamide
TypeSmall organic molecule
Emp. Form.C25H22ClN3O2
Mol. Mass.431.914
SMILESCN(C(=O)c1ccccc1COc1ccc(Cl)cc1)c1ccc2nc(C)cc(N)c2c1