Reaction Details
TargetNociceptin receptor
LigandBDBM50094649
Substrate/Competitorn/a
Meas. Tech.ChEMBL_146120 (CHEMBL754589)
Ki 37±n/a nM
Citation Shinkai, HIto, TIida, TKitao, YYamada, HUchida, I 4-Aminoquinolines: novel nociceptin antagonists with analgesic activity. J Med Chem43:4667-77 (2001) Nociceptin receptor
Name:Nociceptin receptor
Type:G Protein-Coupled Receptor (GPCR)
Mol. Mass.:40702.87
Organism:Homo sapiens (Human)
Description:P41146
Residue:370
BDBM50094649
NameBDBM50094649
Synonyms:CHEMBL140580 | N-(1-Amino-3-methyl-isoquinolin-7-yl)-2-(4-chloro-phenoxymethyl)-benzamide
TypeSmall organic molecule
Emp. Form.C24H20ClN3O2
Mol. Mass.417.888
SMILESCc1cc2ccc(NC(=O)c3ccccc3COc3ccc(Cl)cc3)cc2c(N)n1